{"text_format":"1","workbook":"xlsx","n_sheets":14,"sheets":["TEMPLATE Zahlungsantrag","Zahlungsantrag LEW14-20","TABLE Fördergeber","TEMPLATE Auswahl Belegaufst.","Auswahl Belegaufstellungen","Übersicht","TEMPLATE Übersicht","TEMPLATE Invest & Sachkosten","TEMPLATE Standardkosten","TEMPLATE Unbare Sachleistungen","TEMPLATE Personalkosten","Notizen","TEMPLATE Notizen","TABLE Gehaltsgrenzen"],"not_rendered":{"charts":0,"images":26,"macros":1,"external_links":0,"defined_names":609,"comments":4,"pivot_tables":0},"unopened":[],"bounds":{"document_bytes":16777216,"sheet_cells":100000,"rows_first":2000,"rows_last":500,"rows_between":2000,"halvings":0,"cell_chars":16384,"cell_head_chars":4096},"cells_cut":0,"cells_raw":0,"read":"whole","date_system":"1900"}

{"sheet":"TEMPLATE Zahlungsantrag","index":0,"n_rows":235,"n_cols":40,"rows_kept":235,"cut":false,"hidden":true,"merged":[[128,1,128,38],[6,0,6,38],[7,0,7,38],[8,0,8,38],[10,0,10,22],[10,24,10,38],[0,0,4,8],[0,9,0,12],[0,13,4,38],[1,9,1,12],[2,9,2,12],[3,9,3,12],[4,9,4,12],[30,0,30,38],[31,1,31,7],[31,8,31,24],[31,26,31,30],[26,0,26,38],[28,0,28,11],[11,0,11,22],[11,24,17,38],[13,0,13,15],[17,0,17,13],[17,15,17,17],[28,12,28,21],[28,23,28,30],[28,31,28,38],[21,0,21,38],[22,0,22,38],[24,0,24,11],[24,12,24,38],[19,0,19,38],[15,0,15,7],[15,8,15,10],[15,13,15,20],[36,1,36,7],[36,8,36,24],[36,26,36,30],[33,0,33,38],[34,1,34,7],[34,8,34,24],[34,26,34,30],[41,8,41,24],[41,26,41,31],[41,32,41,38],[38,0,38,38],[39,1,39,7],[39,8,39,38],[41,1,41,7],[66,5,66,38],[60,0,60,11],[60,12,60,38],[54,0,54,11],[50,0,50,7],[50,8,50,24],[50,26,50,30],[52,0,52,11],[52,12,52,38],[58,0,58,11],[58,12,58,38],[42,0,43,38],[44,1,44,7],[44,8,44,38],[56,12,56,38],[48,26,48,30],[56,0,56,11],[46,1,46,7],[46,8,46,38],[48,0,48,7],[48,8,48,24],[68,22,68,30],[82,0,82,24],[80,29,80,32],[76,29,76,34],[80,0,80,24],[80,26,80,27],[76,8,76,9],[76,17,76,18],[54,12,54,38],[72,0,72,38],[74,2,74,9],[74,11,74,18],[68,31,68,38],[70,0,70,38],[74,20,74,27],[74,29,74,36],[68,0,68,6],[68,7,68,20],[62,0,62,38],[66,0,66,4],[64,0,64,3],[64,4,64,24],[64,26,64,29],[64,30,64,38],[76,35,76,36],[78,0,78,19],[78,22,78,23],[78,24,78,28],[78,30,78,31],[78,32,78,36],[76,11,76,16],[76,26,76,27],[76,20,76,25],[76,2,76,7],[88,30,88,31],[88,35,88,36],[90,0,90,24],[90,26,90,27],[88,0,88,24],[88,26,88,27],[80,34,80,37],[86,0,86,24],[86,26,86,27],[86,30,86,31],[82,35,82,36],[82,30,82,31],[86,35,86,36],[84,0,84,24],[84,26,84,27],[84,30,84,31],[84,35,84,36],[82,26,82,27],[94,30,94,31],[94,35,94,36],[92,0,92,24],[92,26,92,27],[90,30,90,31],[90,35,90,36],[92,30,92,31],[92,35,92,36],[94,0,94,24],[94,26,94,27],[100,0,100,24],[100,26,100,27],[102,30,102,31],[102,35,102,36],[102,0,102,24],[102,26,102,27],[100,30,100,31],[100,35,100,36],[96,0,96,6],[96,7,96,24],[98,29,98,32],[98,34,98,37],[98,0,98,24],[98,26,98,27],[104,0,104,24],[104,26,104,27],[104,30,104,31],[104,35,104,36],[121,0,121,6],[121,7,121,24],[110,0,110,24],[110,26,110,27],[113,0,115,24],[114,26,115,37],[110,28,110,37],[112,0,112,38],[117,28,117,35],[119,0,119,6],[133,0,133,6],[133,8,133,22],[133,24,133,38],[130,0,130,38],[132,0,132,6],[132,8,132,22],[132,24,132,38],[123,0,123,38],[106,0,106,24],[106,26,106,27],[106,30,106,31],[106,35,106,36],[117,7,117,24],[108,0,108,6],[108,7,108,24],[121,28,121,35],[117,0,117,6],[119,7,119,24],[119,28,119,35],[129,1,129,38],[124,1,124,38],[125,1,125,38],[126,1,126,38],[127,1,127,38]]}
[null,null,null,null,null,null,null,null,null,"Agrarmarkt Austria"]
[null,null,null,null,null,null,null,null,null,"Dresdner Straße 70",null,null,null,null,null,null,null,null,null,null,null,null,null,null,null,null,null,null,null,null,null,null,null,null,null,null,null,null,null,{"$f":"VLOOKUP(PaymAppl_IntentCode,ProjectTypeSponsors,2)","v":"BMNT/LE1420/LD/EU"}]
[null,null,null,null,null,null,null,null,null,"A-1200 Wien",null,null,null,null,null,null,null,null,null,null,null,null,null,null,null,null,null,null,null,null,null,null,null,null,null,null,null,null,null,"BMNT/LE1420/LD/EU"]
[null,null,null,null,null,null,null,null,null,"www.ama.at",null,null,null,null,null,null,null,null,null,null,null,null,null,null,null,null,null,null,null,null,null,null,null,null,null,null,null,null,null,3]
[null,null,null,null,null,null,null,null,null,"DVR: 0719838",null,null,null,null,null,null,null,null,null,null,null,null,null,null,null,null,null,null,null,null,null,null,null,null,null,null,null,null,null,"Logo-NOe"]
[]
["Zahlungsantrag"]
["zur Auszahlung einer Förderung eines Vorhabens  "]
["im Rahmen des Österreichischen Programms für ländliche Entwicklung 2014 - 2020"]
[]
["Antragsnummer des betroffenen Vorhabens",null,null,null,null,null,null,null,null,null,null,null,null,null,null,null,null,null,null,null,null,null,null,null,"Eingangsvermerk (Einreich-/Bewilligende Stelle)"]
[]
[]
["Bei vorgelegter Abrechnung handelt es sich um die"]
[]
[null,null,null,null,null,null,null,null,null,null,null,null,null,null,null,null,null,null,null,null,null,null,null,null,null,null,null,null,null,null,null,null,null,null,null,null,null,null,null,1]
[]
["Der Gebietskörperschaftsanteil beträgt in %",null,null,null,null,null,null,null,null,null,null,null,null,null,null,null,null,null,null,null,null,null,null,null,null,null,null,null,null,null,null,null,null,null,null,null,null,null,null,{"$f":"IF(PaymAppl_PartialPaymSelect=1,IF(TRIM(PaymAppl_PartialPaymID)=\"\",\"\",\" / TZ \" & TRIM(PaymAppl_PartialPaymID)),\" / EndZ\")","v":""}]
[]
["Vorhaben"]
{"$rows_left_out":216}
{"sheet":"Zahlungsantrag LEW14-20","index":1,"n_rows":235,"n_cols":40,"rows_kept":235,"cut":false,"hidden":false,"merged":[[0,0,4,8],[0,9,0,12],[0,13,4,38],[1,9,1,12],[2,9,2,12],[3,9,3,12],[4,9,4,12],[15,13,15,20],[17,0,17,13],[17,15,17,17],[19,0,19,38],[21,0,21,38],[22,0,22,38],[6,0,6,38],[7,0,7,38],[8,0,8,38],[10,0,10,22],[10,24,10,38],[11,0,11,22],[11,24,17,38],[13,0,13,15],[15,0,15,7],[15,8,15,10],[30,0,30,38],[31,1,31,7],[31,8,31,24],[31,26,31,30],[33,0,33,38],[34,1,34,7],[34,8,34,24],[34,26,34,30],[24,0,24,11],[24,12,24,38],[26,0,26,38],[28,0,28,11],[28,12,28,21],[28,23,28,30],[28,31,28,38],[41,1,41,7],[41,8,41,24],[41,26,41,31],[41,32,41,38],[42,0,43,38],[44,1,44,7],[44,8,44,38],[36,1,36,7],[36,8,36,24],[36,26,36,30],[38,0,38,38],[39,1,39,7],[39,8,39,38],[52,0,52,11],[52,12,52,38],[54,0,54,11],[54,12,54,38],[56,0,56,11],[56,12,56,38],[46,1,46,7],[46,8,46,38],[48,0,48,7],[48,8,48,24],[48,26,48,30],[50,0,50,7],[50,8,50,24],[50,26,50,30],[58,0,58,11],[58,12,58,38],[60,0,60,11],[60,12,60,38],[62,0,62,38],[64,0,64,3],[64,4,64,24],[64,26,64,29],[64,30,64,38],[70,0,70,38],[72,0,72,38],[74,2,74,9],[74,11,74,18],[74,20,74,27],[74,29,74,36],[66,0,66,4],[66,5,66,38],[68,0,68,6],[68,7,68,20],[68,22,68,30],[68,31,68,38],[76,29,76,34],[76,35,76,36],[78,0,78,19],[78,22,78,23],[78,24,78,28],[78,30,78,31],[78,32,78,36],[76,2,76,7],[76,8,76,9],[76,11,76,16],[76,17,76,18],[76,20,76,25],[76,26,76,27],[84,0,84,24],[84,26,84,27],[84,30,84,31],[84,35,84,36],[86,0,86,24],[86,26,86,27],[86,30,86,31],[86,35,86,36],[80,0,80,24],[80,26,80,27],[80,29,80,32],[80,34,80,37],[82,0,82,24],[82,26,82,27],[82,30,82,31],[82,35,82,36],[92,0,92,24],[92,26,92,27],[92,30,92,31],[92,35,92,36],[94,0,94,24],[94,26,94,27],[94,30,94,31],[94,35,94,36],[88,0,88,24],[88,26,88,27],[88,30,88,31],[88,35,88,36],[90,0,90,24],[90,26,90,27],[90,30,90,31],[90,35,90,36],[100,0,100,24],[100,26,100,27],[100,30,100,31],[100,35,100,36],[102,0,102,24],[102,26,102,27],[102,30,102,31],[102,35,102,36],[96,0,96,6],[96,7,96,24],[98,0,98,24],[98,26,98,27],[98,29,98,32],[98,34,98,37],[108,0,108,6],[108,7,108,24],[110,0,110,24],[110,26,110,27],[110,28,110,37],[112,0,112,38],[104,0,104,24],[104,26,104,27],[104,30,104,31],[104,35,104,36],[106,0,106,24],[106,26,106,27],[106,30,106,31],[106,35,106,36],[121,0,121,6],[121,7,121,24],[121,28,121,35],[123,0,123,38],[124,1,124,38],[125,1,125,38],[113,0,115,24],[114,26,115,37],[117,0,117,6],[117,7,117,24],[117,28,117,35],[119,0,119,6],[119,7,119,24],[119,28,119,35],[133,0,133,6],[133,8,133,22],[133,24,133,38],[126,1,126,38],[127,1,127,38],[128,1,128,38],[129,1,129,38],[130,0,130,38],[132,0,132,6],[132,8,132,22],[132,24,132,38]]}
[null,null,null,null,null,null,null,null,null,"Agrarmarkt Austria"]
[null,null,null,null,null,null,null,null,null,"Dresdner Straße 70",null,null,null,null,null,null,null,null,null,null,null,null,null,null,null,null,null,null,null,null,null,null,null,null,null,null,null,null,null,{"$f":"VLOOKUP(PaymAppl_IntentCode,ProjectTypeSponsors,2)","v":"BMNT/LE1420/LD/EU"}]
[null,null,null,null,null,null,null,null,null,"A-1200 Wien",null,null,null,null,null,null,null,null,null,null,null,null,null,null,null,null,null,null,null,null,null,null,null,null,null,null,null,null,null,"BMNT/LE1420/LD/EU"]
[null,null,null,null,null,null,null,null,null,"www.ama.at",null,null,null,null,null,null,null,null,null,null,null,null,null,null,null,null,null,null,null,null,null,null,null,null,null,null,null,null,null,3]
[null,null,null,null,null,null,null,null,null,"DVR: 0719838",null,null,null,null,null,null,null,null,null,null,null,null,null,null,null,null,null,null,null,null,null,null,null,null,null,null,null,null,null,"Logo-NOe"]
[]
["Zahlungsantrag"]
["zur Auszahlung einer Förderung eines Vorhabens  "]
["im Rahmen des Österreichischen Programms für ländliche Entwicklung 2014 - 2020"]
[]
["Antragsnummer des betroffenen Vorhabens",null,null,null,null,null,null,null,null,null,null,null,null,null,null,null,null,null,null,null,null,null,null,null,"Eingangsvermerk (Einreich-/Bewilligende Stelle)"]
[]
[]
["Bei vorgelegter Abrechnung handelt es sich um die"]
[]
[null,null,null,null,null,null,null,null,null,null,null,null,null,null,null,null,null,null,null,null,null,null,null,null,null,null,null,null,null,null,null,null,null,null,null,null,null,null,null,1]
[]
["Der Gebietskörperschaftsanteil beträgt in %",null,null,null,null,null,null,null,null,null,null,null,null,null,null,null,null,null,null,null,null,null,null,null,null,null,null,null,null,null,null,null,null,null,null,null,null,null,null,{"$f":"IF(PaymAppl_PartialPaymSelect=1,IF(TRIM(PaymAppl_PartialPaymID)=\"\",\"\",\" / TZ \" & TRIM(PaymAppl_PartialPaymID)),\" / EndZ\")","v":""}]
[]
["Vorhaben"]
{"$rows_left_out":216}
{"sheet":"TABLE Fördergeber","index":2,"n_rows":87,"n_cols":2,"rows_kept":87,"cut":false,"hidden":true,"merged":[]}
["Vorhabensart (alphabet. Sortiert)","Fördergeber"]
[" - "," - "]
["15.1.1. - Erhaltung von ökologisch wertvollen/seltenen Waldflächen /-gesellschaften","BMNT/LE1420/LD/EU"]
["15.2.1. - Erhaltung und Verbesserung der genetischen Ressourcen des Waldes","BMNT/LE1420/LD/EU"]
["16.01.1. - Unterstützung beim Aufbau & Betrieb operationeller Gruppen der EIP für lw. Produktivität & Nachhaltigkeit","BMNT/LE1420/LD/EU"]
["16.02.1. - Unterstützung bei der Entwicklung neuer Erzeugnisse, Verfahren & Technologien der Land-, Ernährungs- & Forstwirtschaft","BMNT/LE1420/LD/EU"]
["16.02.2. A) - Unterstützung bei der Entwicklung von innovativen Pilotprojekten im Tourismus - BMNT","BMNT/LE/EU"]
["16.02.2. B) - Unterstützung bei der Entwicklung von innovativen Pilotprojekten im Tourismus - Länder","LD/LE1420/EU"]
["16.03.1. A) - Zusammenarbeit von kleinen WirtschaftsteilnehmerInnen - Arbeitsabläufe, Ressourcennutzung und Tourismusdienstleistungen ","BMNT/LE1420/LD/EU"]
["16.03.1. A) - Zusammenarbeit von kleinen WirtschaftsteilnehmerInnen - Arbeitsabläufe, Ressourcennutzung und Tourismusdienstleistungen - BMNT","BMNT/LE1420/EU"]
["16.03.1. B) - Zusammenarbeit von kleinen WirtschaftsteilnehmerInnen - Arbeitsabläufe, Ressourcennutzung und Tourismusdienstleistungen - BMNT","BMNT/LE/EU"]
["16.03.1. C) - Zusammenarbeit von kleinen WirtschaftsteilnehmerInnen - Arbeitsabläufe, Ressourcennutzung und Tourismusdienstleistungen - Länder","LD/LE1420/EU"]
["16.03.2. - Zusammenarbeit von Kleinstunternehmen im ländlichen Raum","BMDW/LE/EU"]
["16.04.1. - Schaffung und Entwicklung von kurzen Versorgungsketten und lokalen Märkten sowie unterstützende Absatzförderung ","BMNT/LE1420/LD/EU"]
["16.05.1. - Stärkung der horizontalen und vertikalen Zusammenarbeit zwischen AkteurInnen im forst- und wasserwirtschaftlichen Sektor","BMNT/LE1420/LD/EU"]
["16.05.2. A) - Stärkung der Zusammenarbeit von AkteurInnen und Strukturen zur Erhaltung des natürlichen Erbes & des Umweltschutzes - Naturschutz","BMNT/LE1420/EU"]
["16.05.2. A) - Stärkung der Zusammenarbeit von AkteurInnen und Strukturen zur Erhaltung des natürlichen Erbes & des Umweltschutzes - Naturschutz - Länder","LD/LE1420/EU"]
["16.05.2. B) - Stärkung der Zusammenarbeit von AkteurInnen und Strukturen zur Erhaltung des natürlichen Erbes & des Umweltschutzes - Umweltschutz","BMNT/LE1420/EU"]
["16.05.2. C) - Stärkung der Zusammenarbeit von AkteurInnen und Strukturen zur Erhaltung des natürlichen Erbes & des Umweltschutzes - Nationalparks","BMNT/LE1420/EU"]
["16.08.1. - Waldbezogene Pläne auf überbetrieblicher Ebene","BMNT/LE1420/LD/EU"]
{"$rows_left_out":68}
{"sheet":"TEMPLATE Auswahl Belegaufst.","index":3,"n_rows":37,"n_cols":5,"rows_kept":37,"cut":false,"hidden":true,"merged":[[0,0,0,4],[8,2,8,3],[30,1,30,3],[2,2,2,3],[4,2,4,3],[6,2,6,3]]}
["Zahlungsantrag - Stammdaten/Übersicht"]
[null,null,null,null,"RL/AMA v469.11 / Feb. 2019"]
[null,"Betriebs-/Klientennummer: "]
[]
[null,"Förderungswerber: "]
[]
[null,"Antragsnummer: "]
[]
[null,"Vorsteuerabzugsberechtigung: ",{"$f":"C10","v":"Nein"}]
[null,null,{"$f":"IF(D10=1,\"Ja\",\"Nein\")","v":"Nein"},2]
[]
[null,"Genehmigter Zeitraum für  ","Beginn","Ende"]
[null,"Kostenanerkennung: "]
[]
[]
[]
[]
[]
[]
[]
{"$rows_left_out":18}
{"sheet":"Auswahl Belegaufstellungen","index":4,"n_rows":37,"n_cols":5,"rows_kept":37,"cut":false,"hidden":true,"merged":[[30,1,30,3],[0,0,0,4],[2,2,2,3],[4,2,4,3],[6,2,6,3],[8,2,8,3]]}
["Zahlungsantrag - Stammdaten/Übersicht"]
[null,null,null,null,"RL/AMA v469.11 / Feb. 2019"]
[null,"Betriebs-/Klientennummer: ",{"$f":"TRIM('Zahlungsantrag LEW14-20'!PaymAppl_ApplicantID)","v":""}]
[]
[null,"Förderungswerber: ",{"$f":"TRIM('Zahlungsantrag LEW14-20'!PaymAppl_ApplicantName)","v":""}]
[]
[null,"Antragsnummer: ",{"$f":"TRIM('Zahlungsantrag LEW14-20'!PaymAppl_ApplicationID) & 'Zahlungsantrag LEW14-20'!PaymAppl_PartialPaymTitle","v":""}]
[]
[null,"Vorsteuerabzugsberechtigung: ",{"$f":"TRIM('Zahlungsantrag LEW14-20'!PaymAppl_TaxDeduct)","v":"Ja"}]
[null,null,{"$f":"IF(D10=1,\"Ja\",\"Nein\")","v":"Nein"},2]
[]
[null,"Genehmigter Zeitraum für  ","Beginn","Ende"]
[null,"Kostenanerkennung: ",{"$f":"IF(TRIM('Zahlungsantrag LEW14-20'!PaymAppl_SupportPeriodStart)=\"\",\"\",'Zahlungsantrag LEW14-20'!PaymAppl_SupportPeriodStart)","v":""},{"$f":"IF(TRIM('Zahlungsantrag LEW14-20'!PaymAppl_SupportPeriodEnd)=\"\",\"\",'Zahlungsantrag LEW14-20'!PaymAppl_SupportPeriodEnd)","v":""}]
[]
[]
[]
[]
[]
[]
[]
{"$rows_left_out":18}
{"sheet":"Übersicht","index":5,"n_rows":54,"n_cols":12,"rows_kept":54,"cut":false,"hidden":false,"merged":[[6,0,6,1],[6,2,6,5],[0,0,0,11],[2,0,2,1],[2,2,2,5],[4,0,4,1],[4,2,4,5],[16,0,16,11],[41,0,41,11],[47,0,47,11],[51,0,51,11],[8,0,8,1],[8,2,8,5],[10,0,10,1],[11,0,11,1],[13,2,13,5],[15,0,15,11]]}
["Übersicht"]
[null,null,null,null,null,null,null,null,null,null,null,"RL/AMA v469.11 / Feb. 2019"]
["Betriebs-/Klientennummer: ",null,{"$f":"TRIM('Auswahl Belegaufstellungen'!Stm_ApplicantID)","v":""}]
[]
["Förderungswerber: ",null,{"$f":"TRIM('Auswahl Belegaufstellungen'!Stm_ApplicantName)","v":""}]
[]
["Antragsnummer: ",null,{"$f":"TRIM('Auswahl Belegaufstellungen'!Stm_ApplicationID)","v":""}]
[]
["Vorsteuerabzugsberechtigung: ",null,{"$f":"'Auswahl Belegaufstellungen'!Stm_TaxDeduct","v":"Ja"}]
[]
["Genehmigter Zeitraum für  ",null,null,"Beginn","---","Ende"]
["Kostenanerkennung: ",null,null,{"$f":"IF(TRIM('Auswahl Belegaufstellungen'!Stm_SupportPeriodStart)=\"\",\"\",'Auswahl Belegaufstellungen'!Stm_SupportPeriodStart)","v":""},"---",{"$f":"IF(TRIM('Auswahl Belegaufstellungen'!Stm_SupportPeriodEnd)=\"\",\"\",'Auswahl Belegaufstellungen'!Stm_SupportPeriodEnd)","v":""}]
[]
[null,"Gruppierung nach:  ","Teilprojekt"]
[]
["Buttons zur internen Verwendung der Bewilligenden Stelle"]
[]
[]
[]
[]
{"$rows_left_out":35}
{"sheet":"TEMPLATE Übersicht","index":6,"n_rows":47,"n_cols":12,"rows_kept":47,"cut":false,"hidden":true,"merged":[[8,0,8,1],[8,2,8,5],[16,0,16,11],[41,0,41,11],[10,0,10,1],[11,0,11,1],[13,2,13,5],[15,0,15,11],[6,0,6,1],[6,2,6,5],[0,0,0,11],[2,0,2,1],[2,2,2,5],[4,0,4,1],[4,2,4,5]]}
["Übersicht"]
[null,null,null,null,null,null,null,null,null,null,null,"RL/AMA v469.11 / Feb. 2019"]
["Betriebs-/Klientennummer: ",null,{"$f":"TRIM(Stm_ApplicantID)","v":""}]
[]
["Förderungswerber: ",null,{"$f":"TRIM(Stm_ApplicantName)","v":""}]
[]
["Antragsnummer: ",null,{"$f":"TRIM(Stm_ApplicationID)","v":""}]
[]
["Vorsteuerabzugsberechtigung: ",null,{"$f":"Stm_TaxDeduct","v":"Nein"}]
[]
["Genehmigter Zeitraum für  ",null,null,"Beginn","---","Ende"]
["Kostenanerkennung: ",null,null,{"$f":"IF(TRIM(Stm_SupportPeriodStart)=\"\",\"\",Stm_SupportPeriodStart)","v":""},"---",{"$f":"IF(TRIM(Stm_SupportPeriodEnd)=\"\",\"\",Stm_SupportPeriodEnd)","v":""}]
[]
[null,"Gruppierung nach:  ","Fördergegenstand"]
[]
["Buttons zur internen Verwendung der Bewilligenden Stelle"]
[]
[]
[]
[]
{"$rows_left_out":28}
{"sheet":"TEMPLATE Invest & Sachkosten","index":7,"n_rows":43,"n_cols":42,"rows_kept":43,"cut":false,"hidden":true,"merged":[[41,3,41,5],[41,7,41,13],[23,18,23,27],[11,2,11,3],[11,4,11,5],[23,2,23,17],[40,3,40,5],[40,7,40,13],[0,2,0,17],[1,16,1,17],[2,16,2,17],[4,2,4,3],[4,4,4,5],[23,38,23,41],[6,2,6,3],[6,4,6,5],[8,2,8,3],[8,4,8,5],[23,29,23,37],[13,2,13,3],[13,4,13,5],[16,2,16,3],[17,2,17,3],[19,2,19,5],[10,2,10,3],[10,4,10,5]]}
[":","Investkosten","Zahlungsantrag - Belegaufstellung für Investitionskosten"]
[":","Sachkosten","Zahlungsantrag - Belegaufstellung für Sachkosten"]
[":","Invest- & Sachkosten","Zahlungsantrag - Belegaufstellung für Investitions- und Sachkosten"]
["UBVbv",null,null,null,null,null,null,null,null,null,null,null,null,null,null,null,null,"RL/AMA v469.11 / Feb. 2019"]
["UBVbv",null,"Betriebs-/Klientennummer: "]
["UBVbv"]
["UBVbv",null,"Förderungswerber: "]
["UBVbv"]
["UBVbv",null,"Antragsnummer: "]
["UBVbv"]
["UBVbv",null,"Fördergegenstand: "]
[]
["UBVbv"]
["UBVbv",null,"Vorsteuerabzugsberechtigung: ",null,{"$f":"E15","v":"Ja"},null,null,"Nein"]
[null,null,null,null,{"$f":"IF(F15=1,\"Ja\",\"Nein\")","v":"Ja"},1]
["UBVbv"]
["UBVbv",null,"Genehmigter Zeitraum für  ",null,"Beginn","Ende"]
["UBVbv",null,"Kostenanerkennung: "]
["UBVbv"]
["UBVbv",null,"Buttons zur internen Verwendung der Bewilligenden Stelle"]
{"$rows_left_out":24}
{"sheet":"TEMPLATE Standardkosten","index":8,"n_rows":40,"n_cols":38,"rows_kept":40,"cut":false,"hidden":true,"merged":[[21,34,21,37],[0,2,0,13],[2,2,2,4],[2,5,2,6],[4,2,4,4],[4,5,4,6],[17,2,17,6],[9,5,9,6],[21,25,21,33],[6,2,6,4],[39,2,39,4],[39,6,39,13],[15,2,15,4],[21,2,21,13],[38,2,38,4],[38,6,38,13],[6,5,6,6],[11,2,11,4],[11,5,11,6],[21,14,21,23],[8,2,8,4],[8,5,8,6],[9,2,9,4],[14,2,14,4]]}
["UBVbv",null,"Zahlungsantrag - Standardkosten"]
["UBVbv",null,null,null,null,null,null,null,null,null,null,null,null,"RL/AMA v469.11 / Feb. 2019"]
["UBVbv",null,"Betriebs-/Klientennummer: "]
["UBVbv"]
["UBVbv",null,"Förderungswerber: "]
["UBVbv"]
["UBVbv",null,"Antragsnummer: "]
["UBVbv"]
["UBVbv",null,"Fördergegenstand: "]
[]
["UBVbv"]
["UBVbv",null,"Vorsteuerabzugsberechtigung: ",null,null,{"$f":"F13","v":"Ja"}]
[null,null,null,null,null,{"$f":"IF(G13=1,\"Ja\",\"Nein\")","v":"Ja"},1]
["UBVbv"]
["UBVbv",null,"Genehmigter Zeitraum für  ",null,null,"Beginn","Ende"]
["UBVbv",null,"Kostenanerkennung: "]
["UBVbv"]
["UBVbv",null,"Buttons zur internen Verwendung der Bewilligenden Stelle"]
["UBVbv"]
["UBVbv"]
{"$rows_left_out":21}
{"sheet":"TEMPLATE Unbare Sachleistungen","index":9,"n_rows":56,"n_cols":37,"rows_kept":56,"cut":false,"hidden":true,"merged":[[35,33,35,36],[28,2,28,4],[28,6,28,7],[54,2,54,4],[54,6,54,13],[35,13,35,22],[32,2,32,12],[35,2,35,12],[53,2,53,4],[53,6,53,13],[35,24,35,32],[29,2,29,4],[29,6,29,7],[31,2,31,12],[26,2,26,4],[26,6,26,7],[27,2,27,4],[15,2,15,4],[27,6,27,7],[22,2,22,4],[22,6,22,7],[24,6,24,7],[21,2,21,4],[21,6,21,7],[20,2,20,7],[17,2,17,6],[23,2,23,4],[23,6,23,7],[25,2,25,4],[25,6,25,7],[24,2,24,4],[0,2,0,12],[6,2,6,4],[6,5,6,6],[8,2,8,4],[8,5,8,6],[2,2,2,4],[4,5,4,6],[2,5,2,6],[4,2,4,4],[11,2,11,4],[11,5,11,6],[14,2,14,4],[9,2,9,4],[9,5,9,6]]}
["UBVbv",null,"Zahlungsantrag - Belegaufstellung unbare Eigenleistungen (=unbare Sachleistungen)"]
["UBVbv",null,null,null,null,null,null,null,null,null,null,null,"RL/AMA v469.11 / Feb. 2019"]
["UBVbv",null,"Betriebs-/Klientennummer: "]
["UBVbv"]
["UBVbv",null,"Förderungswerber: "]
["UBVbv"]
["UBVbv",null,"Antragsnummer: "]
["UBVbv"]
["UBVbv",null,"Fördergegenstand: "]
[]
["UBVbv"]
["UBVbv",null,"Vorsteuerabzugsberechtigung: ",null,null,{"$f":"F13","v":"Ja"}]
[null,null,null,null,null,{"$f":"IF(G13=1,\"Ja\",\"Nein\")","v":"Ja"},1]
["UBVbv"]
["UBVbv",null,"Genehmigter Zeitraum für  ",null,null,"Beginn","Ende"]
["UBVbv",null,"Kostenanerkennung: "]
["UBVbv"]
["UBVbv",null,"Buttons zur internen Verwendung der Bewilligenden Stelle"]
["UBVbv"]
["UBVbv"]
{"$rows_left_out":37}
{"sheet":"TEMPLATE Personalkosten","index":10,"n_rows":242,"n_cols":13,"rows_kept":242,"cut":false,"hidden":true,"merged":[[12,4,12,5],[12,6,12,11],[8,4,8,5],[8,6,8,11],[10,4,10,5],[10,6,10,11],[35,0,35,11],[36,0,36,11],[13,4,13,5],[13,6,13,11],[33,0,33,11],[34,0,34,11],[0,10,0,11],[6,4,6,5],[6,6,6,11],[1,0,1,11],[2,0,2,11],[4,4,4,5],[4,6,4,11]]}
[null,null,null,null,null,null,null,null,null,null,"RL/AMA v469.11 / Feb. 2019"]
["Zahlungsantrag - Belegaufstellung Personalkosten"]
[{"$f":"\"inkl. Obergrenzen für \" &D17","v":"inkl. Obergrenzen für 2019"}]
[]
["Kurzbezeichung des Vorhabens  ",null,null,"X"]
[]
["Betriebs-/Klientennummer ",null,null,"X"]
[]
["Förderungswerber ",null,null,"X"]
[]
["Antragsnummer ",null,null,"X"]
[]
["Fördergegenstand ",null,null,"X"]
["Fördergegenstand ",null,null,"X"]
[]
["Bitte wählen Sie ein Abrechungsmodell:",null,null,"D"]
[null,null,"Ja",{"$f":"'TABLE Gehaltsgrenzen'!A1","v":2019}]
[null,null,"Nein",33553408]
[null,null,"No","D"]
[]
{"$rows_left_out":223}
{"sheet":"Notizen","index":11,"n_rows":16,"n_cols":12,"rows_kept":16,"cut":false,"hidden":false,"merged":[[6,0,6,2],[6,3,6,6],[0,0,0,11],[2,0,2,2],[2,3,2,6],[4,0,4,2],[4,3,4,6],[13,0,13,2],[13,3,13,4],[13,5,13,6],[8,0,8,2],[8,3,8,6],[10,0,10,2],[10,3,10,6],[12,0,12,2],[12,3,12,4],[12,5,12,6]]}
["Zahlungsantrag - Notizen und Anmerkungen"]
[null,null,null,null,null,null,null,null,null,null,null,"RL/AMA v469.11 / Feb. 2019"]
["Betriebs-/Klientennummer: ",null,null,{"$f":"TRIM('Auswahl Belegaufstellungen'!Stm_ApplicantID)","v":""}]
[]
["Förderungswerber: ",null,null,{"$f":"TRIM('Auswahl Belegaufstellungen'!Stm_ApplicantName)","v":""}]
[]
["Antragsnummer: ",null,null,{"$f":"TRIM('Auswahl Belegaufstellungen'!Stm_ApplicationID)","v":""}]
[]
["Fördergegenstand: "]
[]
["Vorsteuerabzugsberechtigung: ",null,null,{"$f":"TRIM('Auswahl Belegaufstellungen'!Stm_TaxDeduct)","v":"Ja"}]
[]
["Genehmigter Zeitraum für  ",null,null,"Beginn",null,"Ende"]
["Kostenanerkennung: ",null,null,{"$f":"IF(TRIM('Auswahl Belegaufstellungen'!Stm_SupportPeriodStart)=\"\",\"\",'Auswahl Belegaufstellungen'!Stm_SupportPeriodStart)","v":""},null,{"$f":"IF(TRIM('Auswahl Belegaufstellungen'!Stm_SupportPeriodEnd)=\"\",\"\",'Auswahl Belegaufstellungen'!Stm_SupportPeriodEnd)","v":""}]
[]
["Hier ist Raum für freie Notizen, Anmerkungen und Nebenrechnungen…"]

{"sheet":"TEMPLATE Notizen","index":12,"n_rows":16,"n_cols":12,"rows_kept":16,"cut":false,"hidden":true,"merged":[[8,0,8,2],[8,3,8,6],[13,0,13,2],[13,3,13,4],[13,5,13,6],[10,0,10,2],[10,3,10,6],[12,0,12,2],[12,3,12,4],[12,5,12,6],[6,0,6,2],[6,3,6,6],[0,0,0,11],[2,0,2,2],[2,3,2,6],[4,0,4,2],[4,3,4,6]]}
["Zahlungsantrag - Notizen und Anmerkungen"]
[null,null,null,null,null,null,null,null,null,null,null,"RL/AMA v469.11 / Feb. 2019"]
["Betriebs-/Klientennummer: "]
[]
["Förderungswerber: "]
[]
["Antragsnummer: "]
[]
["Fördergegenstand: "]
[]
["Vorsteuerabzugsberechtigung: ",null,null,"Ja"]
[]
["Genehmigter Zeitraum für  ",null,null,"Beginn",null,"Ende"]
["Kostenanerkennung: "]
[]
["Hier ist Raum für freie Notizen, Anmerkungen und Nebenrechnungen…"]

{"sheet":"TABLE Gehaltsgrenzen","index":13,"n_rows":61,"n_cols":8,"rows_kept":61,"cut":false,"hidden":true,"merged":[]}
[2019,"[1] Beamten","[2] ASVG"]
["Jahr ","Dienstkl. VII/2","HöchstbeitragsGL"]
[2007,64120.14,53760,{"$f":"B3/14","v":4580.01},{"$f":"C3/14","v":3840}]
[2008,65829.600000000006,55020,4702.1142857142859,3930]
[2009,68166.820000000007,56280,4869.0585714285717,4020]
[2010,68858.89,57540,4918.4921428571424,4110]
[2011,69450,58800,4960.7142857142853,4200]
[2012,71290,59220,5092.1428571428569,4230]
[2013,71280,62160,5091.4285714285716,4440]
[2014,72380,63420,5170,4530]
[2015,73670,65100,5262.1428571428569,4650]
[2016,74870,68040,5347.8571428571431,4860]
[2017,77610,69720,5543.5714285714284,4980]
[2018,79320,71820,5665.7142857142853,5130]
[2019,81570,73080,5826.4285714285716,5220]
[2020,100000,80000,null,{"$f":"C16/14","v":5714.2857142857147}]
[2021,100000,80000,null,{"$f":"C17/14","v":5714.2857142857147}]
[2022,100000,80000,null,{"$f":"C18/14","v":5714.2857142857147}]
[2023,100000,80000,null,{"$f":"C19/14","v":5714.2857142857147}]
[]
{"$rows_left_out":41}